BDBM50065789 2-((E)-Styryl)-quinolin-8-ol::2-Styryl-quinolin-8-ol::2-Styrylquinolin-8-ol::CHEMBL61203
SMILES Oc1cccc2ccc(\C=C\c3ccccc3)nc12
InChI Key InChIKey=BKVXKVKAUFFGAM-PKNBQFBNSA-N
Data  5 IC50
  Tab Delimited (TSV)   2D SDfile   Computed 3D by Vconf -m prep SDfile
Find this compound or compounds like it in BindingDB:
Activity Spreadsheet -- Enzyme Inhibition Constant Data from BindingDB
Found 5 hits for monomerid = 50065789
TargetIntegrase(Human immunodeficiency virus 1)
Paris-Sud University
Curated by ChEMBL
LigandPNGBDBM50065789(2-((E)-Styryl)-quinolin-8-ol | 2-Styryl-quinolin-8...)
Affinity DataIC50: >1.00E+5nM. Assay description: HIV integrase inhibitory potency of the compound was evaluated as IC50 on 3' processing of target DNA.
In DepthDetails ArticlePubMed
TargetIntegrase(Human immunodeficiency virus 1)
Paris-Sud University
Curated by ChEMBL
LigandPNGBDBM50065789(2-((E)-Styryl)-quinolin-8-ol | 2-Styryl-quinolin-8...)
Affinity DataIC50: >1.00E+5nM. Assay description: In vitro anti-HIV integrase activity of the compound was tested against integration(strand transfer) of target plasmid.
In DepthDetails ArticlePubMed
TargetIntegrase(Human immunodeficiency virus 1)
Jadavpur University
Curated by ChEMBL
LigandPNGBDBM50065789(2-((E)-Styryl)-quinolin-8-ol | 2-Styryl-quinolin-8...)
Affinity DataIC50:  1.00E+5nM. Assay description: Inhibition of HIV1 integrase 3' processing activity
In DepthDetails ArticlePubMed
TargetGag-Pol polyprotein(Rous sarcoma virus (strain Prague C) (RSV-PrC))
Cnrs Umr 8532
Curated by ChEMBL
LigandPNGBDBM50065789(2-((E)-Styryl)-quinolin-8-ol | 2-Styryl-quinolin-8...)
Affinity DataIC50: >1.00E+5nM. Assay description: Inhibition of rous sarcoma virus (RSV) Integrase.Checked by Author
In DepthDetails ArticlePubMed
TargetGag-Pol polyprotein [489-587](Human immunodeficiency virus type 1)
Cnrs Umr 8532
Curated by ChEMBL
LigandPNGBDBM50065789(2-((E)-Styryl)-quinolin-8-ol | 2-Styryl-quinolin-8...)
Affinity DataIC50: >1.00E+5nM. Assay description: Compound was tested in vitro to inhibit human immuno virus-1 (HIV-1) using enzymatic disintegration assay.Checked by Author
In DepthDetails ArticlePubMed