BDBM50065954 (S)-5-chloro-N-(1-(dimethylamino)-1-oxo-3-phenylpropan-2-yl)-1H-indole-2-carboxamide::5-Chloro-1H-indole-2-carboxylic acid ((S)-1-dimethylcarbamoyl-2-phenyl-ethyl)-amide::CHEMBL430503
SMILES CN(C)C(=O)[C@H](Cc1ccccc1)NC(=O)c1cc2cc(Cl)ccc2[nH]1
InChI Key InChIKey=SWJYEZLPKNELRP-SFHVURJKSA-N
Data  2 IC50
  Tab Delimited (TSV)   2D SDfile   Computed 3D by Vconf -m prep SDfile
Find this compound or compounds like it in BindingDB:
Activity Spreadsheet -- Enzyme Inhibition Constant Data from BindingDB
Found 2 hits for monomerid = 50065954
TargetGlycogen phosphorylase, liver form(Homo sapiens (Human))
Astrazeneca
Curated by ChEMBL
LigandPNGBDBM50065954((S)-5-chloro-N-(1-(dimethylamino)-1-oxo-3-phenylpr...)
Affinity DataIC50:  51nM. Assay description: Inhibition of recombinant human liver GPa by multienzyme coupled assay
In DepthDetails ArticlePubMed
TargetGlycogen phosphorylase, liver form(Homo sapiens (Human))
Astrazeneca
Curated by ChEMBL
LigandPNGBDBM50065954((S)-5-chloro-N-(1-(dimethylamino)-1-oxo-3-phenylpr...)
Affinity DataIC50:  82nM. Assay description: In vitro inhibitory activity against recombinant human liver glycogen phosphorylase a (rHLGPa) catalyzed release of phosphate from glucose-1-phosphat...
In DepthDetails ArticlePubMed