BDBM50066347 2-Morpholin-4-yl-N-[6-(2-morpholin-4-yl-acetylamino)-9,10-dioxo-9,10-dihydro-anthracen-2-yl]-acetamide; compound with acetic acid::CHEMBL111206
SMILES O=C(CN1CCOCC1)Nc1ccc2C(=O)c3cc(NC(=O)CN4CCOCC4)ccc3C(=O)c2c1
InChI Key InChIKey=RDUDGLRJNZMVNR-UHFFFAOYSA-N
Data  1 IC50
  Tab Delimited (TSV)   2D SDfile   Computed 3D by Vconf -m prep SDfile
Find this compound or compounds like it in BindingDB:
Activity Spreadsheet -- Enzyme Inhibition Constant Data from BindingDB
Found 1 hit for monomerid = 50066347
TargetTelomerase reverse transcriptase(Homo sapiens (Human))
The Institute Of Cancer Research
Curated by ChEMBL
LigandPNGBDBM50066347(2-Morpholin-4-yl-N-[6-(2-morpholin-4-yl-acetylamin...)
Affinity DataIC50: >5.00E+4nM. Assay description: Inhibition of telomerase activity
In DepthDetails ArticlePubMed