BDBM50066363 3-Dipropylamino-N-[6-(3-dipropylamino-propionylamino)-9,10-dioxo-9,10-dihydro-anthracen-2-yl]-propionamide; compound with acetic acid::CHEMBL111785
SMILES CCCN(CCC)CCC(=O)Nc1ccc2C(=O)c3cc(NC(=O)CCN(CCC)CCC)ccc3C(=O)c2c1
InChI Key InChIKey=NWGMIGUVKVPXLG-UHFFFAOYSA-N
Data  1 IC50
  Tab Delimited (TSV)   2D SDfile   Computed 3D by Vconf -m prep SDfile
Find this compound or compounds like it in BindingDB:
Activity Spreadsheet -- Enzyme Inhibition Constant Data from BindingDB
Found 1 hit for monomerid = 50066363
TargetTelomerase reverse transcriptase(Homo sapiens (Human))
The Institute Of Cancer Research
Curated by ChEMBL
LigandPNGBDBM50066363(3-Dipropylamino-N-[6-(3-dipropylamino-propionylami...)
Affinity DataIC50: >5.00E+4nM. Assay description: Inhibition of telomerase activity
In DepthDetails ArticlePubMed