BDBM50066402 (2S,3R,4S)-4-Benzo[1,3]dioxol-5-yl-1-dibutylcarbamoylmethyl-2-(4-methyl-pent-4-enyl)-pyrrolidine-3-carboxylic acid::CHEMBL320763
SMILES CCCCN(CCCC)C(=O)CN1C[C@@H]([C@H]([C@@H]1CCCC(C)=C)C(O)=O)c1ccc2OCOc2c1
InChI Key InChIKey=LKBRIPNKLIPOEQ-QSEAXJEQSA-N
Data  2 IC50
  Tab Delimited (TSV)   2D SDfile   Computed 3D by Vconf -m prep SDfile
Find this compound or compounds like it in BindingDB:
Activity Spreadsheet -- Enzyme Inhibition Constant Data from BindingDB
Found 2 hits for monomerid = 50066402
TargetEndothelin receptor type B(Homo sapiens (Human))
Abbott Laboratories
Curated by ChEMBL
LigandPNGBDBM50066402((2S,3R,4S)-4-Benzo[1,3]dioxol-5-yl-1-dibutylcarbam...)
Affinity DataIC50:  3.60E+4nM. Assay description: Binding affinity for endothelin B receptor by measuring its ability to displace [125I]-ET-3 from porcine cerebellar tissue
In DepthDetails ArticlePubMed
TargetEndothelin-1 receptor(RAT)
Abbott Laboratories
Curated by ChEMBL
LigandPNGBDBM50066402((2S,3R,4S)-4-Benzo[1,3]dioxol-5-yl-1-dibutylcarbam...)
Affinity DataIC50:  5.20nM. Assay description: Binding affinity for endothelin A receptor by measuring its ability to displace [125I]-ET-1 from prolactin secreting rat pituitary cells(MMQ)
In DepthDetails ArticlePubMed