BDBM50066458 ((S)-1-{(1S,2S)-1-Benzyl-3-[N-biphenyl-4-ylmethyl-N'-((S)-2-methoxycarbonylamino-3-methyl-butyryl)-hydrazino]-2-hydroxy-propylcarbamoyl}-2,2-dimethyl-propyl)-carbamic acid methyl ester::CHEMBL113824
SMILES COC(=O)N[C@@H](C(C)C)C(=O)NN(C[C@H](O)[C@H](Cc1ccccc1)NC(=O)[C@@H](NC(=O)OC)C(C)(C)C)Cc1ccc(cc1)-c1ccccc1
InChI Key InChIKey=DXYWQVONJOEGHT-ZWDYZTTJSA-N
Data  1 IC50
  Tab Delimited (TSV)   2D SDfile   Computed 3D by Vconf -m prep SDfile
Find this compound or compounds like it in BindingDB:
Activity Spreadsheet -- Enzyme Inhibition Constant Data from BindingDB
Found 1 hit for monomerid = 50066458
TargetReverse transcriptase/RNaseH(Human immunodeficiency virus 1)
Ciba-Geigy
Curated by ChEMBL
LigandPNGBDBM50066458(((S)-1-{(1S,2S)-1-Benzyl-3-[N-biphenyl-4-ylmethyl-...)
Affinity DataIC50:  85nM. Assay description: The percent reduction of the reverse transcriptase (RT) activity in HIV-1/MN-infected MT-2 cells.
In DepthDetails ArticlePubMed