BDBM50066687 (S)-2-[(R)-8-(5-Chloro-4'-fluoro-biphenyl-2-yl)-2-hydroxy-octyl]-2-hydroxy-succinic acid::CHEMBL263490
SMILES O[C@H](CCCCCCc1ccc(Cl)cc1-c1ccc(F)cc1)C[C@](O)(CC(O)=O)C(O)=O
InChI Key InChIKey=ZWPXZNPPOVGGCB-YKSBVNFPSA-N
Data  1 KI
  Tab Delimited (TSV)   2D SDfile   Computed 3D by Vconf -m prep SDfile
Find this compound or compounds like it in BindingDB:
Activity Spreadsheet -- Enzyme Inhibition Constant Data from BindingDB
Found 1 hit for monomerid = 50066687
TargetATP-citrate synthase(Homo sapiens (Human))
Smithkline Beecham Pharmaceuticals
Curated by ChEMBL
LigandPNGBDBM50066687((S)-2-[(R)-8-(5-Chloro-4'-fluoro-biphenyl-2-yl)-2-...)
Affinity DataKi:  2.70E+3nM. Assay description: Inhibitory activity against human recombinant ATP-Citrate Lyase (ACL) enzyme
In DepthDetails ArticlePubMed