BDBM50066699 (S)-2-[(R)-7-(5-Chloro-indol-1-yl)-2-hydroxy-heptyl]-2-hydroxy-succinic acid::CHEMBL330778
SMILES O[C@H](CCCCCn1ccc2cc(Cl)ccc12)C[C@](O)(CC(O)=O)C(O)=O
InChI Key InChIKey=JEAOLDRXPIVSPY-BEFAXECRSA-N
Data  1 KI
  Tab Delimited (TSV)   2D SDfile   Computed 3D by Vconf -m prep SDfile
Find this compound or compounds like it in BindingDB:
Activity Spreadsheet -- Enzyme Inhibition Constant Data from BindingDB
Found 1 hit for monomerid = 50066699
TargetATP-citrate synthase(Homo sapiens (Human))
Smithkline Beecham Pharmaceuticals
Curated by ChEMBL
LigandPNGBDBM50066699((S)-2-[(R)-7-(5-Chloro-indol-1-yl)-2-hydroxy-hepty...)
Affinity DataKi:  3.50E+3nM. Assay description: Inhibitory activity against human recombinant ATP-Citrate Lyase (ACL) enzyme
In DepthDetails ArticlePubMed