BDBM50066761 CHEMBL3400497
SMILES OC(=O)c1nc(sc1CCCCc1ccccc1)-c1ccc2CCC\C(=N/Nc3nc4ccccc4s3)c2c1
InChI Key InChIKey=KJRCRYVHSPWAIC-JGRMKTMXSA-N
Data  1 IC50
PDB links: 1 PDB ID matches this monomer.
  Tab Delimited (TSV)   2D SDfile   Computed 3D by Vconf -m prep SDfile
Find this compound or compounds like it in BindingDB:
Activity Spreadsheet -- Enzyme Inhibition Constant Data from BindingDB
Found 1 hit for monomerid = 50066761
TargetBcl-2-like protein 1(Homo sapiens (Human))
Bioprojet-Biotech
Curated by ChEMBL
LigandPNGBDBM50066761(CHEMBL3400497)
Affinity DataIC50:  1.5nM. Assay description: Inhibition of GST-tagged Bcl-xL (unknown origin) measured after 1 hr incubation by fluorescence polarization assay
In DepthDetails ArticlePubMed