BDBM50066779 5-Butyl-4-methyl-pyrrolidin-(2E)-ylideneamine; hydrochloride::CHEMBL553119
SMILES CCCCC1N=C(N)CC1C
InChI Key InChIKey=OBXOGVLGKRSWQZ-UHFFFAOYSA-N
Data  3 IC50
  Tab Delimited (TSV)   2D SDfile   Computed 3D by Vconf -m prep SDfile
Find this compound or compounds like it in BindingDB:
Activity Spreadsheet -- Enzyme Inhibition Constant Data from BindingDB
Found 3 hits for monomerid = 50066779
TargetNitric oxide synthase, brain(Homo sapiens (Human))
Pfizer
Curated by ChEMBL
LigandPNGBDBM50066779(5-Butyl-4-methyl-pyrrolidin-(2E)-ylideneamine; hyd...)
Affinity DataIC50:  850nM. Assay description: Inhibition of cloned (from RNA) human Neuronal nitric oxide synthase
In DepthDetails ArticlePubMed
TargetNitric oxide synthase, endothelial(Homo sapiens (Human))
Pfizer
Curated by ChEMBL
LigandPNGBDBM50066779(5-Butyl-4-methyl-pyrrolidin-(2E)-ylideneamine; hyd...)
Affinity DataIC50:  2.36E+4nM. Assay description: Inhibition of cloned (from RNA) human endothelial constitutive Endothelial nitric oxide synthase (heNOS)
In DepthDetails ArticlePubMed
TargetNitric oxide synthase, inducible(Homo sapiens (Human))
Pfizer
Curated by ChEMBL
LigandPNGBDBM50066779(5-Butyl-4-methyl-pyrrolidin-(2E)-ylideneamine; hyd...)
Affinity DataIC50:  660nM. Assay description: Inhibition of cloned (from RNA) human inducible nitric oxide synthase (hiNOS)
In DepthDetails ArticlePubMed