BDBM50066866 CHEMBL3401643
SMILES O[C@@](C1CCCC1)(C(=O)N[C@H]1CN2CCC1CC2)c1cccs1
InChI Key InChIKey=SWLGIXHESZQGPK-MAUKXSAKSA-N
Data  3 IC50
  Tab Delimited (TSV)   2D SDfile   Computed 3D by Vconf -m prep SDfile
Find this compound or compounds like it in BindingDB:
Activity Spreadsheet -- Enzyme Inhibition Constant Data from BindingDB
Found 3 hits for monomerid = 50066866
TargetMuscarinic acetylcholine receptor M1(Homo sapiens (Human))
RhôNe-Poulenc Rorer
Curated by ChEMBL
LigandPNGBDBM50066866(CHEMBL3401643)
Affinity DataIC50:  0.400nM. Assay description: Displacement of [3H]NMS from human M1 receptor expressed in CHOK1 cell membranes after 4 hrs by scintillation counting method
In DepthDetails ArticlePubMed
TargetMuscarinic acetylcholine receptor M3(Homo sapiens (Human))
RhôNe-Poulenc Rorer
Curated by ChEMBL
LigandPNGBDBM50066866(CHEMBL3401643)
Affinity DataIC50:  1.10nM. Assay description: Displacement of [3H]NMS from human M3 receptor expressed in CHOK1 cell membranes after 4 hrs by scintillation counting method
In DepthDetails ArticlePubMed
TargetMuscarinic acetylcholine receptor M2(Homo sapiens (Human))
RhôNe-Poulenc Rorer
Curated by ChEMBL
LigandPNGBDBM50066866(CHEMBL3401643)
Affinity DataIC50:  4.20nM. Assay description: Displacement of [3H]NMS from human M2 receptor expressed in CHOK1 cell membranes after 4 hrs by scintillation counting method
In DepthDetails ArticlePubMed