BDBM50067014 5-[3-(3,3-Dimethyl-piperidin-1-yl)-propyl]-5,6,7,8-tetrahydro-naphthalen-1-ol::CHEMBL338465
SMILES CC1(C)CCCN(CCCC2CCCc3c(O)cccc23)C1
InChI Key InChIKey=KMIQLQWOYZTXGK-UHFFFAOYSA-N
Data  1 IC50
  Tab Delimited (TSV)   2D SDfile   Computed 3D by Vconf -m prep SDfile
Find this compound or compounds like it in BindingDB:
Activity Spreadsheet -- Enzyme Inhibition Constant Data from BindingDB
Found 1 hit for monomerid = 50067014
TargetSigma non-opioid intracellular receptor 1(RAT)
Università
Curated by ChEMBL
LigandPNGBDBM50067014(5-[3-(3,3-Dimethyl-piperidin-1-yl)-propyl]-5,6,7,8...)
Affinity DataIC50:  41nM. Assay description: Evaluated for the binding affinity towards sigma 1 receptor by displacing the radioligand [3H]-SKF- 10047 in whole rat brain membrane.
In DepthDetails ArticlePubMed