BDBM50067180 CHEMBL3401725
SMILES Clc1ccc(cc1Cl)C(=O)Nc1nc2ccccc2[nH]1
InChI Key InChIKey=XTCYKXYLOUABIM-UHFFFAOYSA-N
Data  1 IC50
  Tab Delimited (TSV)   2D SDfile   Computed 3D by Vconf -m prep SDfile
Find this compound or compounds like it in BindingDB:
Activity Spreadsheet -- Enzyme Inhibition Constant Data from BindingDB
Found 1 hit for monomerid = 50067180
TargetMetabotropic glutamate receptor 5(Mus musculus)
University Of Maryland
Curated by ChEMBL
LigandPNGBDBM50067180(CHEMBL3401725)
Affinity DataIC50:  9.80E+3nM. Assay description: Positive allosteric modulator activity at mGluR5 in mouse BV2 cells assessed as inhibition of nitric oxide production pre-treated 1 hr before lipopol...
In DepthDetails ArticlePubMed