BDBM50067276 CHEMBL542479::N-({[2,4-Dimethyl-3-(2-methyl-quinolin-8-yloxymethyl)-phenyl]-methyl-carbamoyl}-methyl)-3-[6-(2-oxo-pyrrolidin-1-yl)-pyridin-3-yl]-acrylamide; dihydrochloride
SMILES CN(C(=O)CNC(=O)\C=C\c1ccc(nc1)N1CCCC1=O)c1ccc(C)c(COc2cccc3ccc(C)nc23)c1C
InChI Key InChIKey=XULFIMKYMXXHKE-GHRIWEEISA-N
Data  2 IC50
  Tab Delimited (TSV)   2D SDfile   Computed 3D by Vconf -m prep SDfile
Find this compound or compounds like it in BindingDB:
Activity Spreadsheet -- Enzyme Inhibition Constant Data from BindingDB
Found 2 hits for monomerid = 50067276
TargetB2 bradykinin receptor(Homo sapiens (Human))
Fujisawa Pharmaceutical
Curated by ChEMBL
LigandPNGBDBM50067276(CHEMBL542479 | N-({[2,4-Dimethyl-3-(2-methyl-quino...)
Affinity DataIC50:  1.40nM. Assay description: Concentration required to inhibit specific binding of [ 3H]BK (0.06 nM) to Bradykinin receptor B2 in guinea pig ileum membrane preparations by 50%.
In DepthDetails ArticlePubMed
TargetB2 bradykinin receptor(Cavia porcellus)
Fujisawa Pharmaceutical
Curated by ChEMBL
LigandPNGBDBM50067276(CHEMBL542479 | N-({[2,4-Dimethyl-3-(2-methyl-quino...)
Affinity DataIC50:  1.40nM. Assay description: Concentration required to inhibit specific binding of [ 3H]BK (0.06 nM) to Bradykinin receptor B2 in guinea pig ileum membrane preparations by 50%.
In DepthDetails ArticlePubMed