BDBM50067297 4-{(E)-2-[({[2,4-Dichloro-3-(2-methoxy-1-methyl-1H-benzoimidazol-4-yloxymethyl)-phenyl]-methyl-carbamoyl}-methyl)-carbamoyl]-vinyl}-N,N-dimethyl-benzamide::CHEMBL132510
SMILES COc1nc2c(OCc3c(Cl)ccc(N(C)C(=O)CNC(=O)\C=C\c4ccc(cc4)C(=O)N(C)C)c3Cl)cccc2n1C
InChI Key InChIKey=AZGZSEGUTUYBMW-LFIBNONCSA-N
Data  2 IC50
  Tab Delimited (TSV)   2D SDfile   Computed 3D by Vconf -m prep SDfile
Find this compound or compounds like it in BindingDB:
Activity Spreadsheet -- Enzyme Inhibition Constant Data from BindingDB
Found 2 hits for monomerid = 50067297
TargetB2 bradykinin receptor(Homo sapiens (Human))
Fujisawa Pharmaceutical
Curated by ChEMBL
LigandPNGBDBM50067297(4-{(E)-2-[({[2,4-Dichloro-3-(2-methoxy-1-methyl-1H...)
Affinity DataIC50:  14nM. Assay description: Inhibition specific binding of [3H]BK (1.0 nM) to human Bradykinin receptor B2 which was expressed in CHO (Chinese hamster ovary) cells by 50%.
In DepthDetails ArticlePubMed
TargetB2 bradykinin receptor(Cavia porcellus)
Fujisawa Pharmaceutical
Curated by ChEMBL
LigandPNGBDBM50067297(4-{(E)-2-[({[2,4-Dichloro-3-(2-methoxy-1-methyl-1H...)
Affinity DataIC50:  0.940nM. Assay description: Concentration required to inhibit specific binding of [ 3H]BK (0.06 nM) to Bradykinin receptor B2 in guinea pig ileum membrane preparations by 50%.
In DepthDetails ArticlePubMed