BDBM50067450 CHEMBL3401805
SMILES Clc1ccc(cc1)S(=O)(=O)NC(=O)[C@H](Cc1ccccc1)N1C(=S)S\C(=C/c2ccc(cc2)-c2ccccc2)C1=O
InChI Key InChIKey=LSRSDYUCERXVEN-AOOQNHMPSA-N
Data  1 KI
  Tab Delimited (TSV)   2D SDfile   Computed 3D by Vconf -m prep SDfile
Find this compound or compounds like it in BindingDB:
Activity Spreadsheet -- Enzyme Inhibition Constant Data from BindingDB
Found 1 hit for monomerid = 50067450
TargetBcl-2-like protein 1(Homo sapiens (Human))
Shandong University
Curated by ChEMBL
LigandPNGBDBM50067450(CHEMBL3401805)
Affinity DataKi:  510nM. Assay description: Inhibition of Bcl-XL (unknown origin) using 5-FAM-Bid-BH3 as substrate preincubated for 30 mins before substrate addition measured after 20 mins by f...
In DepthDetails ArticlePubMed