BDBM50067464 CHEMBL3401798
SMILES [O-][N+](=O)c1ccc(cc1)-c1ccc(\C=C2/SC(=S)N([C@@H](Cc3ccccc3)C(=O)NS(=O)(=O)c3ccccc3)C2=O)cc1
InChI Key InChIKey=JJSBHPCPSWWCPR-AOOQNHMPSA-N
Data  1 KI
  Tab Delimited (TSV)   2D SDfile   Computed 3D by Vconf -m prep SDfile
Find this compound or compounds like it in BindingDB:
Activity Spreadsheet -- Enzyme Inhibition Constant Data from BindingDB
Found 1 hit for monomerid = 50067464
TargetBcl-2-like protein 1(Homo sapiens (Human))
Shandong University
Curated by ChEMBL
LigandPNGBDBM50067464(CHEMBL3401798)
Affinity DataKi:  460nM. Assay description: Inhibition of Bcl-XL (unknown origin) using 5-FAM-Bid-BH3 as substrate preincubated for 30 mins before substrate addition measured after 20 mins by f...
In DepthDetails ArticlePubMed