BDBM50067470 4-[3-(4-Prop-1-ynyl-phenoxy)-propyl]-1H-imidazole::CHEMBL132798
SMILES CC#Cc1ccc(OCCCc2cnc[nH]2)cc1
InChI Key InChIKey=BQZUIABJTFOQMI-UHFFFAOYSA-N
Data  1 KI
  Tab Delimited (TSV)   2D SDfile   Computed 3D by Vconf -m prep SDfile
Find this compound or compounds like it in BindingDB:
Activity Spreadsheet -- Enzyme Inhibition Constant Data from BindingDB
Found 1 hit for monomerid = 50067470
TargetHistamine H3 receptor(Rattus norvegicus (rat))
Freie UniversitäT Berlin
Curated by ChEMBL
LigandPNGBDBM50067470(4-[3-(4-Prop-1-ynyl-phenoxy)-propyl]-1H-imidazole ...)
Affinity DataKi:  7.5nM. Assay description: In vitro antagonist potency at Histamine H3 receptor measured as K+-evoked [3H]-histamine release from synaptosomes of rat cerebral cortex.
In DepthDetails ArticlePubMed