BDBM50067582 (S)-2-{[3'-Methoxy-5-(pyridin-3-yloxymethyl)-biphenyl-2-carbonyl]-amino}-4-methylsulfanyl-butyric acid::CHEMBL136023
SMILES COc1cccc(c1)-c1cc(COc2cccnc2)ccc1C(=O)N[C@@H](CCSC)C(O)=O
InChI Key InChIKey=ZKMGCRAOUHROOG-QHCPKHFHSA-N
Data  1 IC50
  Tab Delimited (TSV)   2D SDfile   Computed 3D by Vconf -m prep SDfile
Find this compound or compounds like it in BindingDB:
Activity Spreadsheet -- Enzyme Inhibition Constant Data from BindingDB
Found 1 hit for monomerid = 50067582
LigandPNGBDBM50067582((S)-2-{[3'-Methoxy-5-(pyridin-3-yloxymethyl)-biphe...)
Affinity DataIC50:  12nM. Assay description: In vitro inhibition of farnesyltransferase from bovine brain
In DepthDetails ArticlePubMed