BDBM50067770 1-Cycloheptyl-1-[4-(4-fluoro-phenoxy)-benzyl]-3-(2-methoxy-6-methyl-pyridin-3-yl)-urea::CHEMBL265829
SMILES COc1nc(C)ccc1NC(=O)N(Cc1ccc(Oc2ccc(F)cc2)cc1)C1CCCCCC1
InChI Key InChIKey=OFJQEZNUPHKTNZ-UHFFFAOYSA-N
Data  1 IC50
  Tab Delimited (TSV)   2D SDfile   Computed 3D by Vconf -m prep SDfile
Find this compound or compounds like it in BindingDB:
Activity Spreadsheet -- Enzyme Inhibition Constant Data from BindingDB
Found 1 hit for monomerid = 50067770
TargetAcyl-CoA:cholesterol acyltransferase(Oryctolagus cuniculus)
Fujisawa Pharmaceutical
Curated by ChEMBL
LigandPNGBDBM50067770(1-Cycloheptyl-1-[4-(4-fluoro-phenoxy)-benzyl]-3-(2...)
Affinity DataIC50:  39nM. Assay description: In vitro inhibition of acyl coenzyme A:cholesterol acyltransferase (ACAT) from rabbit intestinal microsomes
In DepthDetails ArticlePubMed