BDBM50067775 2-Oxopentane-1,5-bisphosphonic Acid
SMILES [O-]P([O-])(=O)CCCC(=O)CP([O-])([O-])=O
InChI Key InChIKey=FKDNMNYXYZDBDH-UHFFFAOYSA-J
Data  1 Kd
  Tab Delimited (TSV)   2D SDfile   Computed 3D by Vconf -m prep SDfile
Find this compound or compounds like it in BindingDB:
Activity Spreadsheet -- Enzyme Inhibition Constant Data from BindingDB
Found 1 hit for monomerid = 50067775
TargetPhosphoglycerate kinase(Saccharomyces cerevisiae)
University Of Sheffield
Curated by ChEMBL
LigandPNGBDBM50067775(2-Oxopentane-1,5-bisphosphonic Acid)
Affinity DataKd:  1.90E+4nM. Assay description: Dissociation constant of phosphoglycerate kinase (PGK) at pH (3.0-11.0) was determined
Ligand InfoPC cidPC sid
In DepthDetails ArticlePubMed