BDBM50067853 2-Ethyl-butyric acid 2-((10R,13S,17R)-17-hydroxy-10,13-dimethyl-3,11-dioxo-2,3,6,7,8,9,10,11,12,13,14,15,16,17-tetradecahydro-1H-cyclopenta[a]phenanthren-17-yl)-2-oxo-ethyl ester::CHEMBL141968
SMILES CCC(CC)C(=O)OCC(=O)[C@@]1(O)CCC2C3CCC4=CC(=O)CC[C@]4(C)C3C(=O)C[C@]12C
InChI Key InChIKey=HWEXVHURJZFMLF-ZPLUJIPHSA-N
Data  1 IC50
  Tab Delimited (TSV)   2D SDfile   Computed 3D by Vconf -m prep SDfile
Find this compound or compounds like it in BindingDB:
Activity Spreadsheet -- Enzyme Inhibition Constant Data from BindingDB
Found 1 hit for monomerid = 50067853
TargetProtein farnesyltransferase subunit beta/geranylgeranyltransferase type-1 subunit alpha(Homo sapiens (Human))
Merck Research Laboratories
Curated by ChEMBL
LigandPNGBDBM50067853(2-Ethyl-butyric acid 2-((10R,13S,17R)-17-hydroxy-1...)
Affinity DataIC50:  5.60E+4nM. Assay description: inhibitory activity against human Farnesyltransferase
In DepthDetails ArticlePubMed