BDBM50068103 CHEMBL1375713
SMILES Cc1ccc(CNCCc2ccccc2F)s1
InChI Key InChIKey=NZNHJQFNTSWMCR-UHFFFAOYSA-N
Data  1 IC50
PDB links: 1 PDB ID matches this monomer.
  Tab Delimited (TSV)   2D SDfile   Computed 3D by Vconf -m prep SDfile
Find this compound or compounds like it in BindingDB:
Activity Spreadsheet -- Enzyme Inhibition Constant Data from BindingDB
Found 1 hit for monomerid = 50068103
TargetBifunctional epoxide hydrolase 2(Homo sapiens (Human))
Astellas Pharma
Curated by ChEMBL
LigandPNGBDBM50068103(CHEMBL1375713)
Affinity DataIC50:  9.00E+3nM. Assay description: Inhibition of C-terminal His6-tagged full-length human soluble epoxide hydrolase expressed in Escherichia coli BL21(DE3) cells pre-incubated for 15 m...