BDBM50068314 CHEMBL145490::N-[9,10-Dioxo-5-(3-(N,N,N-trimethyl-propionylamino)-9,10-dihydro-anthracen-1-yl]-3-(N,N,N-trimethyl)-propionamide; diiodide
SMILES C[N+](C)(C)CCC(=O)Nc1cccc2C(=O)c3c(NC(=O)CC[N+](C)(C)C)cccc3C(=O)c12
InChI Key InChIKey=OEOGTNYPNGSQHS-UHFFFAOYSA-P
Data  1 IC50
  Tab Delimited (TSV)   2D SDfile   Computed 3D by Vconf -m prep SDfile
Find this compound or compounds like it in BindingDB:
Activity Spreadsheet -- Enzyme Inhibition Constant Data from BindingDB
Found 1 hit for monomerid = 50068314
TargetTelomerase reverse transcriptase(Homo sapiens (Human))
The Institute Of Cancer Research
Curated by ChEMBL
LigandPNGBDBM50068314(CHEMBL145490 | N-[9,10-Dioxo-5-(3-(N,N,N-trimethyl...)
Affinity DataIC50:  1.32E+4nM. Assay description: Inhibitory activity of telomerase was measured using the TRAP assay.
In DepthDetails ArticlePubMed