BDBM50068402 CHEMBL3403432
SMILES CCCNc1nc(C)c(-c2nc3ccccc3s2)c(N[C@@H]2CC[C@@H](O)[C@H]2O)n1
InChI Key InChIKey=XCFDBQKWISPVLM-CPUCHLNUSA-N
Data  1 IC50
  Tab Delimited (TSV)   2D SDfile   Computed 3D by Vconf -m prep SDfile
Find this compound or compounds like it in BindingDB:
Activity Spreadsheet -- Enzyme Inhibition Constant Data from BindingDB
Found 1 hit for monomerid = 50068402
TargetInterleukin-1 receptor-associated kinase 4(Homo sapiens (Human))
Merck Research Laboratories
Curated by ChEMBL
LigandPNGBDBM50068402(CHEMBL3403432)
Affinity DataIC50: >2.00E+4nM. Assay description: Inhibition of N-terminal GST tagged human recombinant full-length IRAK4 expressed in Sf9 insect cells assessed as reduction in substrate phosphorylat...
In DepthDetails ArticlePubMed