BDBM50068415 CHEMBL2018071
SMILES Cc1nc(NCC2CC2)nc(N[C@@H]2C[C@H](CO)[C@@H](O)[C@H]2O)c1-c1nc2ccccc2s1
InChI Key InChIKey=FUNYGYOXBIXUGQ-LRHNDGHRSA-N
Data  1 IC50
  Tab Delimited (TSV)   2D SDfile   Computed 3D by Vconf -m prep SDfile
Find this compound or compounds like it in BindingDB:
Activity Spreadsheet -- Enzyme Inhibition Constant Data from BindingDB
Found 1 hit for monomerid = 50068415
TargetInterleukin-1 receptor-associated kinase 4(Homo sapiens (Human))
Merck Research Laboratories
Curated by ChEMBL
LigandPNGBDBM50068415(CHEMBL2018071)
Affinity DataIC50: >2.00E+4nM. Assay description: Inhibition of N-terminal GST tagged human recombinant full-length IRAK4 expressed in Sf9 insect cells assessed as reduction in substrate phosphorylat...
In DepthDetails ArticlePubMed