BDBM50068423 3-(3,4-Dimethyl-phenyl)-piperidine::CHEMBL356746
SMILES Cc1ccc(cc1C)C1CCCNC1
InChI Key InChIKey=NDGKSXYKTXZIQO-UHFFFAOYSA-N
Data  2 KI
  Tab Delimited (TSV)   2D SDfile   Computed 3D by Vconf -m prep SDfile
Find this compound or compounds like it in BindingDB:
Activity Spreadsheet -- Enzyme Inhibition Constant Data from BindingDB
Found 2 hits for monomerid = 50068423
TargetD(2) dopamine receptor(BOVINE)
Universit£
Curated by ChEMBL
LigandPNGBDBM50068423(3-(3,4-Dimethyl-phenyl)-piperidine | CHEMBL356746)
Affinity DataKi:  140nM. Assay description: Inhibition of [3H]YM-09151-2 binding to bovine retina membrane Dopamine receptor D2, high affinity site
In DepthDetails ArticlePubMed
TargetD(2) dopamine receptor(BOVINE)
Universit£
Curated by ChEMBL
LigandPNGBDBM50068423(3-(3,4-Dimethyl-phenyl)-piperidine | CHEMBL356746)
Affinity DataKi:  1.90E+4nM. Assay description: Inhibition of [3H]YM-09151-2 binding to bovine retina membrane Dopamine receptor D2, low affinity site
In DepthDetails ArticlePubMed