BDBM50068438 2-(2-Nitro-phenyl)-1-[4-(3-phenyl-propyl)-piperazin-1-yl]-ethanone::CHEMBL144469
SMILES [O-][N+](=O)c1ccccc1CC(=O)N1CCN(CCCc2ccccc2)CC1
InChI Key InChIKey=CBUHEWSZFIJEIZ-UHFFFAOYSA-N
Data  1 KI
  Tab Delimited (TSV)   2D SDfile   Computed 3D by Vconf -m prep SDfile
Find this compound or compounds like it in BindingDB:
Activity Spreadsheet -- Enzyme Inhibition Constant Data from BindingDB
Found 1 hit for monomerid = 50068438
TargetSigma non-opioid intracellular receptor 1(Homo sapiens (Human))
National Institute Of Diabetes And Digestive And Kidney Diseases
Curated by ChEMBL
LigandPNGBDBM50068438(2-(2-Nitro-phenyl)-1-[4-(3-phenyl-propyl)-piperazi...)
Affinity DataKi:  7.90nM. Assay description: Binding affinity was tested against sigma-1 receptor in guinea brain membranes.
In DepthDetails ArticlePubMed