BDBM50068535 CHEMBL3403452::US9598440, 17
SMILES OC[C@H]1C[C@@H](Nc2nc(NC3CCOCC3)ncc2-c2nc3ccccc3s2)[C@H](O)[C@@H]1O
InChI Key InChIKey=IBSLUFAJRNDJPN-WTMJQUOKSA-N
Data  2 IC50
  Tab Delimited (TSV)   2D SDfile   Computed 3D by Vconf -m prep SDfile
Find this compound or compounds like it in BindingDB:
Activity Spreadsheet -- Enzyme Inhibition Constant Data from BindingDB
Found 2 hits for monomerid = 50068535
TargetInterleukin-1 receptor-associated kinase 4(Homo sapiens (Human))
Merck Sharp & Dohme
US Patent
LigandPNGBDBM50068535(CHEMBL3403452 | US9598440, 17)
Affinity DataIC50:  41nM. Assay description: Procedure: A 20 μl reaction mixture contains 10 mM TriHCl, pH 7.2, 0.5 nM GST tagged IRAK4 (SignalChem), 100 nM fluorescent peptide substrate (R...
In DepthDetails US Patent
TargetInterleukin-1 receptor-associated kinase 4(Homo sapiens (Human))
Merck Sharp & Dohme
US Patent
LigandPNGBDBM50068535(CHEMBL3403452 | US9598440, 17)
Affinity DataIC50:  1.08E+6nM. Assay description: Inhibition of N-terminal GST tagged human recombinant full-length IRAK4 expressed in Sf9 insect cells assessed as reduction in substrate phosphorylat...
In DepthDetails ArticlePubMed