BDBM50068544 CHEMBL3402354
SMILES Cc1c(NC(=O)c2ccc(cc2)C(C)(C)C)cccc1-c1cn(C)c(=O)c(Nc2ccc(cc2)C(=O)NCCOCCOCCNC(=S)Nc2ccc(c(c2)C(O)=O)-c2c3ccc(O)cc3oc3cc(=O)ccc23)n1
InChI Key InChIKey=ZQADIWXHQYQOOA-UHFFFAOYSA-N
Data  2 IC50  1 Kd
  Tab Delimited (TSV)   2D SDfile   Computed 3D by Vconf -m prep SDfile
Find this compound or compounds like it in BindingDB:
Activity Spreadsheet -- Enzyme Inhibition Constant Data from BindingDB
Found 3 hits for monomerid = 50068544
TargetTyrosine-protein kinase BTK(Homo sapiens (Human))
Carna Biosciences
Curated by ChEMBL
LigandPNGBDBM50068544(CHEMBL3402354)
Affinity DataIC50:  305nM. Assay description: Inhibition of biotinylated and activated BTK (unknown origin) using FITC-labeled Srctide peptide substrate and ATP
In DepthDetails ArticlePubMed
TargetTyrosine-protein kinase BTK(Homo sapiens (Human))
Carna Biosciences
Curated by ChEMBL
LigandPNGBDBM50068544(CHEMBL3402354)
Affinity DataKd:  8.80nM. Assay description: Binding affinity to biotinylated and unactivated BTK (unknown origin) incubated for 1 hr by TR-FRET assay
In DepthDetails ArticlePubMed
TargetTyrosine-protein kinase BTK(Homo sapiens (Human))
Carna Biosciences
Curated by ChEMBL
LigandPNGBDBM50068544(CHEMBL3402354)
Affinity DataIC50:  7.80nM. Assay description: Inhibition of biotinylated and unactivated BTK (unknown origin) using FITC-labeled Srctide peptide substrate and ATP
In DepthDetails ArticlePubMed