BDBM50068588 1-(3,3-Dimethyl-2-oxo-pentanoyl)-piperidine-2-carboxylic acid 3-pyridin-3-yl-propyl ester::CHEMBL108247
SMILES CCC(C)(C)C(=O)C(=O)N1CCCCC1C(=O)OCCCc1cccnc1
InChI Key InChIKey=QWXZXAJVNZLOLY-UHFFFAOYSA-N
Data  1 KI
  Tab Delimited (TSV)   2D SDfile   Computed 3D by Vconf -m prep SDfile
Find this compound or compounds like it in BindingDB:
Activity Spreadsheet -- Enzyme Inhibition Constant Data from BindingDB
Found 1 hit for monomerid = 50068588
TargetPeptidyl-prolyl cis-trans isomerase FKBP1A(Homo sapiens (Human))
Guilford Pharmaceuticals
Curated by ChEMBL
LigandPNGBDBM50068588(1-(3,3-Dimethyl-2-oxo-pentanoyl)-piperidine-2-carb...)
Affinity DataKi:  130nM. Assay description: Compound was tested for its ability to inhibit FK506 binding protein 12 rotamase activity
In DepthDetails ArticlePubMed