BDBM50068639 2-(1H-Benzoimidazol-2-ylsulfanyl)-1-(3-chloro-4-hydroxy-phenyl)-ethanone oxime::CHEMBL358371
SMILES Oc1ccc(cc1Cl)C(CSc1nc2ccccc2[nH]1)N=O
InChI Key InChIKey=JMJTZJMAXIKLQO-UHFFFAOYSA-N
Data  1 KI
  Tab Delimited (TSV)   2D SDfile   Computed 3D by Vconf -m prep SDfile
Find this compound or compounds like it in BindingDB:
Activity Spreadsheet -- Enzyme Inhibition Constant Data from BindingDB
Found 1 hit for monomerid = 50068639
TargetGlucagon receptor(Homo sapiens (Human))
Novo Nordisk
Curated by ChEMBL
LigandPNGBDBM50068639(2-(1H-Benzoimidazol-2-ylsulfanyl)-1-(3-chloro-4-hy...)
Affinity DataKi: >5.00E+5nM. Assay description: Binding affinity towards cloned human glucagon receptor in BHK cells.
In DepthDetails ArticlePubMed