BDBM50068656 2-[(2S,3S)-2-Amino-3-(4-hydroxy-phenyl)-butyryl]-1,2,3,4-tetrahydro-isoquinoline-3-carboxylic acid [1-(1-carbamoyl-2-phenyl-ethylcarbamoyl)-2-phenyl-ethyl]-amide::CHEMBL2364557
SMILES N[C@@H](Cc1ccc(O)cc1)C(=O)N1Cc2ccccc2C[C@H]1C(=O)N[C@H](Cc1ccccc1)C(=O)N[C@@H](Cc1ccccc1)C(N)=O
InChI Key InChIKey=HLGLOFWWPYOSAE-SSNHPIBPSA-N
Data  2 KI
  Tab Delimited (TSV)   2D SDfile   Computed 3D by Vconf -m prep SDfile
Find this compound or compounds like it in BindingDB:
Activity Spreadsheet -- Enzyme Inhibition Constant Data from BindingDB
Found 2 hits for monomerid = 50068656
TargetDelta-type opioid receptor(Homo sapiens (Human))
Vrije Universiteit Brussel
Curated by ChEMBL
LigandPNGBDBM50068656(2-[(2S,3S)-2-Amino-3-(4-hydroxy-phenyl)-butyryl]-1...)
Affinity DataKi:  7.80nM. Assay description: Binding affinity towards human Opioid receptor delta 1 on NxG108CC15 (human neuroglioblastoma) cell membranes by [3H]DPDPE displacement.
In DepthDetails ArticlePubMed
TargetMu-type opioid receptor(Rattus norvegicus (rat))
Vrije Universiteit Brussel
Curated by ChEMBL
LigandPNGBDBM50068656(2-[(2S,3S)-2-Amino-3-(4-hydroxy-phenyl)-butyryl]-1...)
Affinity DataKi:  7.83nM. Assay description: Binding affinity towards Opioid receptor mu 1 on rat forebrain membranes by [3H]sufentanil displacement.
In DepthDetails ArticlePubMed