BDBM50068743 4'-Isobutyl-2'-methoxy-biphenyl-2-sulfonic acid (3,4-dimethyl-isoxazol-5-yl)-amide::CHEMBL148853
SMILES COc1cc(CC(C)C)ccc1-c1ccccc1S(=O)(=O)Nc1onc(C)c1C
InChI Key InChIKey=CEQZTVDVWMGLDZ-UHFFFAOYSA-N
Data  2 KI
  Tab Delimited (TSV)   2D SDfile   Computed 3D by Vconf -m prep SDfile
Find this compound or compounds like it in BindingDB:
Activity Spreadsheet -- Enzyme Inhibition Constant Data from BindingDB
Found 2 hits for monomerid = 50068743
TargetEndothelin-1 receptor(RAT)
Bristol-Myers Squibb Pharmaceutical Research Institute
Curated by ChEMBL
LigandPNGBDBM50068743(4'-Isobutyl-2'-methoxy-biphenyl-2-sulfonic acid (3...)
Affinity DataKi:  74nM. Assay description: Ability to inhibit binding of [125I]ET1 to membranes prepared from A10 rat thoracic aorta smooth muscle Endothelin A receptor
In DepthDetails ArticlePubMed
TargetEndothelin receptor type B(RAT)
Bristol-Myers Squibb Pharmaceutical Research Institute
Curated by ChEMBL
LigandPNGBDBM50068743(4'-Isobutyl-2'-methoxy-biphenyl-2-sulfonic acid (3...)
Affinity DataKi:  5.40E+4nM. Assay description: Ability to inhibit binding of [125I]-ET-1 to membranes prepared from A10 rat cerebellum (Endothelin B receptor)
In DepthDetails ArticlePubMed