BDBM50068872 CHEMBL3402363
SMILES CCOc1ccc(Nc2ccnc(Nc3ccc(OCC)cc3)n2)cc1
InChI Key InChIKey=KOQKFBMGLKODKH-UHFFFAOYSA-N
Data  1 EC50
  Tab Delimited (TSV)   2D SDfile   Computed 3D by Vconf -m prep SDfile
Find this compound or compounds like it in BindingDB:
Activity Spreadsheet -- Enzyme Inhibition Constant Data from BindingDB
Found 1 hit for monomerid = 50068872
TargetTyrosine-protein kinase SYK(Homo sapiens (Human))
Amarit Bioscience
Curated by ChEMBL
LigandPNGBDBM50068872(CHEMBL3402363)
Affinity DataEC50:  3.38E+3nM. Assay description: Inhibition of SYK in human mast cell cultures assessed as reduction in IgE-induced FCepsilonR1 mediated degranulation by tryptase release assay
In DepthDetails ArticlePubMed