BDBM50068980 2,2-Diethyl-N-[3-(quinolin-2-ylmethoxy)-phenyl]-succinamic acid::CHEMBL367424
SMILES CCC(CC)(CC(=O)Nc1cccc(OCc2ccc3ccccc3n2)c1)C(O)=O
InChI Key InChIKey=CCQQISILGFBECU-UHFFFAOYSA-N
Data  2 IC50
  Tab Delimited (TSV)   2D SDfile   Computed 3D by Vconf -m prep SDfile
Find this compound or compounds like it in BindingDB:
Activity Spreadsheet -- Enzyme Inhibition Constant Data from BindingDB
Found 2 hits for monomerid = 50068980
TargetCysteinyl leukotriene receptor 1/2(Homo sapiens (Human))
Novartis Pharma
Curated by ChEMBL
LigandPNGBDBM50068980(2,2-Diethyl-N-[3-(quinolin-2-ylmethoxy)-phenyl]-su...)
Affinity DataIC50:  0.900nM. Assay description: In vitro for antagonistic activity against LTD4 receptor in guinea pig ileum
In DepthDetails ArticlePubMed
TargetCysteinyl leukotriene receptor 1(GUINEA PIG)
Novartis Pharma
Curated by ChEMBL
LigandPNGBDBM50068980(2,2-Diethyl-N-[3-(quinolin-2-ylmethoxy)-phenyl]-su...)
Affinity DataIC50:  9nM. Assay description: Compound was evaluated in vitro for inhibition of [3H]-LTD4 binding to guinea pig lung membrane
In DepthDetails ArticlePubMed