BDBM50069130 (2S,4R)-2-Amino-4-(3-phenyl-propyl)-pentanedioic acid::2-Amino-4-(3-phenyl-propyl)-pentanedioic acid::CHEMBL305387
SMILES N[C@@H](C[C@@H](CCCc1ccccc1)C(O)=O)C(O)=O
InChI Key InChIKey=WXUSMGPIDBQKHZ-NEPJUHHUSA-N
Data  2 KI
  Tab Delimited (TSV)   2D SDfile   Computed 3D by Vconf -m prep SDfile
Find this compound or compounds like it in BindingDB:
Activity Spreadsheet -- Enzyme Inhibition Constant Data from BindingDB
Found 2 hits for monomerid = 50069130
TargetGlutamate receptor ionotropic, kainate 1(Homo sapiens (Human))
Eli Lilly
Curated by ChEMBL
LigandPNGBDBM50069130((2S,4R)-2-Amino-4-(3-phenyl-propyl)-pentanedioic a...)
Affinity DataKi:  1.19E+3nM. Assay description: Binding affinity against human ionotropic glutamate receptor kainate 1 in HK293 cells using [3H]-kainate as radioligand
In DepthDetails ArticlePubMed
TargetGlutamate receptor ionotropic, kainate 2(Homo sapiens (Human))
Eli Lilly
Curated by ChEMBL
LigandPNGBDBM50069130((2S,4R)-2-Amino-4-(3-phenyl-propyl)-pentanedioic a...)
Affinity DataKi: >1.00E+4nM. Assay description: Binding affinity against human ionotropic glutamate receptor ionotropic kainate 2 in HEK293 cells using [3H]-kainate as radioligand
In DepthDetails ArticlePubMed