BDBM50069300 CHEMBL350901::N-hydroxy-N-cyclopentyl-3-(4-hydrazonoformamidephenyl)-2-[(2-naphthylsulfonyl)amino]propanamide
SMILES NN=C(N)c1ccc(C[C@H](NS(=O)(=O)c2ccc3ccccc3c2)C(=O)N(O)C2CCCC2)cc1
InChI Key InChIKey=XXZWYOWYYLLOLZ-QHCPKHFHSA-N
Data  1 KI
  Tab Delimited (TSV)   2D SDfile   Computed 3D by Vconf -m prep SDfile
Find this compound or compounds like it in BindingDB:
Activity Spreadsheet -- Enzyme Inhibition Constant Data from BindingDB
Found 1 hit for monomerid = 50069300
TargetProthrombin(Bos taurus (Bovine))
Biotech Research Institute
Curated by ChEMBL
LigandPNGBDBM50069300(CHEMBL350901 | N-hydroxy-N-cyclopentyl-3-(4-hydraz...)
Affinity DataKi:  367nM. Assay description: Compound was tested for inhibitory activity against bovine thrombin
In DepthDetails ArticlePubMed