BDBM50069313 CHEMBL158474::Phosphoric acid mono-((1S,2S,3R,4S,5S,6S)-2,5-dihydroxy-3,4,6-tris-phosphonooxy-cyclohexyl) ester
SMILES O[C@H]1[C@H](OP(O)(O)=O)[C@@H](OP(O)(O)=O)[C@H](O)[C@@H](OP(O)(O)=O)[C@H]1OP(O)(O)=O
InChI Key InChIKey=ZAWIXNGTTZTBKV-VLFADPLGSA-N
Data  1 IC50
  Tab Delimited (TSV)   2D SDfile   Computed 3D by Vconf -m prep SDfile
Find this compound or compounds like it in BindingDB:
Activity Spreadsheet -- Enzyme Inhibition Constant Data from BindingDB
Found 1 hit for monomerid = 50069313
TargetInositol 1,4,5-trisphosphate receptor type 3(Bos taurus)
Pohang University Of Science & Technology
Curated by ChEMBL
LigandPNGBDBM50069313(CHEMBL158474 | Phosphoric acid mono-((1S,2S,3R,4S,...)
Affinity DataIC50:  598nM. Assay description: Binding affinity towards Inositol 1,4,5-trisphosphate receptor was evaluated by the standard competitive binding assay using 1.25 nM [3H]-D-I(1,4,5)P...
In DepthDetails ArticlePubMed