BDBM50069321 CHEMBL3403546::US9688661, 1-(5-Chloro-2-ethylphenyl)-4-(pyrrolo[2,1-f][1,2,4]triazin-4-yl)-1H-pyrrole-2-carboxamide (compd 240)
SMILES CCc1ccc(Cl)cc1-n1cc(cc1C(N)=O)-c1ncnn2cccc12
InChI Key InChIKey=WBGURWAKCQAEQW-UHFFFAOYSA-N
Data  4 IC50
  Tab Delimited (TSV)   2D SDfile   Computed 3D by Vconf -m prep SDfile
Find this compound or compounds like it in BindingDB:
Activity Spreadsheet -- Enzyme Inhibition Constant Data from BindingDB
Found 4 hits for monomerid = 50069321
TargetTyrosine-protein kinase JAK2(Homo sapiens (Human))
Nerviano Medical Sciences
Curated by ChEMBL
LigandPNGBDBM50069321(CHEMBL3403546 | US9688661, 1-(5-Chloro-2-ethylphen...)
Affinity DataIC50:  20nM. Assay description: Inhibition of recombinant epitope-tagged JAK2 (808 to 1132) (unknown origin) using LPLDKDYYVVREPGQ as substrate by beta-countiing analysis in presenc...
In DepthDetails ArticlePubMed
TargetNon-receptor tyrosine-protein kinase TYK2 [833-1187](Homo sapiens (Human))
Nerviano Medical Sciences
US Patent
LigandPNGBDBM50069321(CHEMBL3403546 | US9688661, 1-(5-Chloro-2-ethylphen...)
Affinity DataIC50:  27nM. Assay description: Assays were performed with the TYK2 kinase domain (residues 833-1187 of the 1187 amino acid long full-length sequence, accession number P29597 of Uni...
In DepthDetails US Patent
TargetTyrosine-protein kinase JAK2(Homo sapiens (Human))
Nerviano Medical Sciences
Curated by ChEMBL
LigandPNGBDBM50069321(CHEMBL3403546 | US9688661, 1-(5-Chloro-2-ethylphen...)
Affinity DataIC50:  20nM. Assay description: Assays were performed with the commercially available JAK2 kinase domain (Invitrogen, Eugene, Oreg.) that showed a linear kinetic without prephosphor...
In DepthDetails US Patent
TargetTyrosine-protein kinase JAK1 [861-1152](Homo sapiens (Human))
Nerviano Medical Sciences
US Patent
LigandPNGBDBM50069321(CHEMBL3403546 | US9688661, 1-(5-Chloro-2-ethylphen...)
Affinity DataIC50:  134nM. Assay description: Assays were performed with the JAK1 kinase domain (residues 861-1152 of the 1154 amino acid long full-length sequence, accession number P23458 of Uni...
In DepthDetails US Patent