BDBM50069419 (4-{3-[2-(4-Chloro-phenoxymethyl)-4-methyl-benzoimidazol-1-yl]-propyl}-piperidin-1-yl)-acetic acid::CHEMBL344722
SMILES Cc1cccc2n(CCCC3CCN(CC(O)=O)CC3)c(COc3ccc(Cl)cc3)nc12
InChI Key InChIKey=JUDWLBHPOLUVKF-UHFFFAOYSA-N
Data  1 KI
  Tab Delimited (TSV)   2D SDfile   Computed 3D by Vconf -m prep SDfile
Find this compound or compounds like it in BindingDB:
Activity Spreadsheet -- Enzyme Inhibition Constant Data from BindingDB
Found 1 hit for monomerid = 50069419
TargetNeuropeptide Y receptor type 1(Homo sapiens (Human))
Eli Lilly
Curated by ChEMBL
LigandPNGBDBM50069419((4-{3-[2-(4-Chloro-phenoxymethyl)-4-methyl-benzoim...)
Affinity DataKi:  2.19E+3nM. Assay description: Binding affinity at cloned Neuropeptide Y-1 receptor expressed in AV-12 cells is evaluated.
In DepthDetails ArticlePubMed