BDBM50069560 Biphalin Analogue::CHEMBL2371080
SMILES C[C@@H](NC(=O)[C@@H](N)Cc1ccc(O)cc1)C(=O)NCC(=O)N[C@@H](Cc1c(F)c(F)c(F)c(F)c1F)C(=O)NNC(=O)[C@H](Cc1c(F)c(F)c(F)c(F)c1F)NC(=O)CNC(=O)[C@@H](C)NC(=O)[C@@H](N)Cc1ccc(O)cc1
InChI Key InChIKey=GCVFQGNOWGFECF-UWPALRQLSA-N
Data  2 KI  2 IC50
  Tab Delimited (TSV)   2D SDfile   Computed 3D by Vconf -m prep SDfile
Find this compound or compounds like it in BindingDB:
Activity Spreadsheet -- Enzyme Inhibition Constant Data from BindingDB
Found 4 hits for monomerid = 50069560
TargetMu-type opioid receptor(GUINEA PIG)
University Of Arizona
Curated by ChEMBL
LigandPNGBDBM50069560(Biphalin Analogue | CHEMBL2371080)
Affinity DataKi:  0.910nM. Assay description: Compound was tested for binding affinity towards mu opioid receptor in guinea pig brain homogenates using [3H]-CTOP as radioligand
In DepthDetails ArticlePubMed
TargetDelta-type opioid receptor(Homo sapiens (Human))
University Of Arizona
Curated by ChEMBL
LigandPNGBDBM50069560(Biphalin Analogue | CHEMBL2371080)
Affinity DataKi:  7.80nM. Assay description: Compound was tested for binding affinity towards Opioid receptor delta 1 in guinea pig brain homogenates using [3H]-[p-Cl-Phe]-DPDPE as radioligand
In DepthDetails ArticlePubMed
TargetDelta-type opioid receptor(MOUSE)
University Of Arizona
Curated by ChEMBL
LigandPNGBDBM50069560(Biphalin Analogue | CHEMBL2371080)
Affinity DataIC50:  8.90nM. Assay description: Inhibitory concentration required against biological activity of Opioid receptor delta 1 from mouse vas deferens (MVD)
In DepthDetails ArticlePubMed
TargetMu-type opioid receptor(GUINEA PIG)
University Of Arizona
Curated by ChEMBL
LigandPNGBDBM50069560(Biphalin Analogue | CHEMBL2371080)
Affinity DataIC50:  8.90nM. Assay description: Inhibitory concentration required against biological activity of mu opioid receptor from guinea pig ileum (GPI)
In DepthDetails ArticlePubMed