BDBM50070137 CHEMBL12498::Pentane-1-sulfonic acid (4-{2-[(S)-2-hydroxy-3-(4-hydroxy-phenoxy)-propylamino]-ethyl}-phenyl)-amide
SMILES CCCCCS(=O)(=O)Nc1ccc(CCNC[C@H](O)COc2ccc(O)cc2)cc1
InChI Key InChIKey=PSQPNBVYTLBESR-NRFANRHFSA-N
Data  2 IC50  1 EC50
  Tab Delimited (TSV)   2D SDfile   Computed 3D by Vconf -m prep SDfile
Find this compound or compounds like it in BindingDB:
Activity Spreadsheet -- Enzyme Inhibition Constant Data from BindingDB
Found 3 hits for monomerid = 50070137
TargetBeta-2 adrenergic receptor(Homo sapiens (Human))
Merck Research Laboratories
Curated by ChEMBL
LigandPNGBDBM50070137(CHEMBL12498 | Pentane-1-sulfonic acid (4-{2-[(S)-2...)
Affinity DataIC50:  250nM. Assay description: Binding affinity against cloned human beta-2 adrenergic receptor from CHO cells using [125I]-iodocyanopindolol as the radioligand
In DepthDetails ArticlePubMed
TargetBeta-1 adrenergic receptor(Homo sapiens (Human))
Merck Research Laboratories
Curated by ChEMBL
LigandPNGBDBM50070137(CHEMBL12498 | Pentane-1-sulfonic acid (4-{2-[(S)-2...)
Affinity DataIC50:  1.00E+3nM. Assay description: Tested for binding affinity against cloned human beta-1 adrenergic receptor from CHO cells using [125I]-iodocyanopindolol as the radioligand
In DepthDetails ArticlePubMed
TargetBeta-3 adrenergic receptor(Homo sapiens (Human))
Merck Research Laboratories
Curated by ChEMBL
LigandPNGBDBM50070137(CHEMBL12498 | Pentane-1-sulfonic acid (4-{2-[(S)-2...)
Affinity DataEC50:  4.00E+3nM. Assay description: Agonist activity against cloned human beta-3 adrenergic receptor
In DepthDetails ArticlePubMed