BDBM50070139 4-{(S)-2-Hydroxy-3-[(R)-3-(4-methoxy-phenyl)-1-methyl-propylamino]-propoxy}-phenol::CHEMBL274361
SMILES COc1ccc(CC[C@@H](C)NC[C@H](O)COc2ccc(O)cc2)cc1
InChI Key InChIKey=FVXAAPNMRWHMJD-QAPCUYQASA-N
Data  2 EC50
  Tab Delimited (TSV)   2D SDfile   Computed 3D by Vconf -m prep SDfile
Find this compound or compounds like it in BindingDB:
Activity Spreadsheet -- Enzyme Inhibition Constant Data from BindingDB
Found 2 hits for monomerid = 50070139
TargetBeta-3 adrenergic receptor(Homo sapiens (Human))
Merck Research Laboratories
Curated by ChEMBL
LigandPNGBDBM50070139(4-{(S)-2-Hydroxy-3-[(R)-3-(4-methoxy-phenyl)-1-met...)
Affinity DataEC50:  600nM. Assay description: Agonist activity against cloned human beta-3 adrenergic receptor
In DepthDetails ArticlePubMed
TargetBeta-2 adrenergic receptor(Homo sapiens (Human))
Merck Research Laboratories
Curated by ChEMBL
LigandPNGBDBM50070139(4-{(S)-2-Hydroxy-3-[(R)-3-(4-methoxy-phenyl)-1-met...)
Affinity DataEC50:  5nM. Assay description: Compound was tested for agonist activity against cloned human beta-2 adrenergic receptor
In DepthDetails ArticlePubMed