BDBM50070168 CHEMBL13389::[4-(4-{2-[(S)-2-Hydroxy-3-(4-hydroxy-phenoxy)-propylamino]-ethyl}-phenylsulfamoyl)-phenyl]-carbamic acid methyl ester
SMILES COC(=O)Nc1ccc(cc1)S(=O)(=O)Nc1ccc(CCNC[C@H](O)COc2ccc(O)cc2)cc1
InChI Key InChIKey=LDRZYITZMHAKQN-QFIPXVFZSA-N
Data  2 IC50  1 EC50
  Tab Delimited (TSV)   2D SDfile   Computed 3D by Vconf -m prep SDfile
Find this compound or compounds like it in BindingDB:
Activity Spreadsheet -- Enzyme Inhibition Constant Data from BindingDB
Found 3 hits for monomerid = 50070168
TargetBeta-2 adrenergic receptor(Homo sapiens (Human))
Merck Research Laboratories
Curated by ChEMBL
LigandPNGBDBM50070168(CHEMBL13389 | [4-(4-{2-[(S)-2-Hydroxy-3-(4-hydroxy...)
Affinity DataIC50:  430nM. Assay description: In vitro affinity at Beta-2 adrenergic receptor in the presence of [125I]-iodocyanopindolol.
In DepthDetails ArticlePubMed
TargetBeta-1 adrenergic receptor(Homo sapiens (Human))
Merck Research Laboratories
Curated by ChEMBL
LigandPNGBDBM50070168(CHEMBL13389 | [4-(4-{2-[(S)-2-Hydroxy-3-(4-hydroxy...)
Affinity DataIC50:  250nM. Assay description: In vitro affinity at Beta-1 adrenergic receptor in the presence of [125I]-iodocyanopindolol.
In DepthDetails ArticlePubMed
TargetBeta-3 adrenergic receptor(Homo sapiens (Human))
Merck Research Laboratories
Curated by ChEMBL
LigandPNGBDBM50070168(CHEMBL13389 | [4-(4-{2-[(S)-2-Hydroxy-3-(4-hydroxy...)
Affinity DataEC50:  0.700nM. Assay description: Agonist activity towards human Beta-3 adrenergic receptor
In DepthDetails ArticlePubMed