BDBM50070179 4-(3-Hexyl-3-methyl-ureido)-N-(4-{2-[(S)-2-hydroxy-3-(4-hydroxy-phenoxy)-propylamino]-ethyl}-phenyl)-benzenesulfonamide::CHEMBL274144
SMILES CCCCCCN(C)C(=O)Nc1ccc(cc1)S(=O)(=O)Nc1ccc(CCNC[C@H](O)COc2ccc(O)cc2)cc1
InChI Key InChIKey=FBJSOTGGJZTIBA-NDEPHWFRSA-N
Data  2 IC50  1 EC50
  Tab Delimited (TSV)   2D SDfile   Computed 3D by Vconf -m prep SDfile
Find this compound or compounds like it in BindingDB:
Activity Spreadsheet -- Enzyme Inhibition Constant Data from BindingDB
Found 3 hits for monomerid = 50070179
TargetBeta-2 adrenergic receptor(Homo sapiens (Human))
Merck Research Laboratories
Curated by ChEMBL
LigandPNGBDBM50070179(4-(3-Hexyl-3-methyl-ureido)-N-(4-{2-[(S)-2-hydroxy...)
Affinity DataIC50:  720nM. Assay description: In vitro affinity at Beta-2 adrenergic receptor in the presence of [125I]-iodocyanopindolol.
In DepthDetails ArticlePubMed
TargetBeta-1 adrenergic receptor(Homo sapiens (Human))
Merck Research Laboratories
Curated by ChEMBL
LigandPNGBDBM50070179(4-(3-Hexyl-3-methyl-ureido)-N-(4-{2-[(S)-2-hydroxy...)
Affinity DataIC50:  800nM. Assay description: In vitro affinity at Beta-1 adrenergic receptor in the presence of [125I]-iodocyanopindolol.
In DepthDetails ArticlePubMed
TargetBeta-3 adrenergic receptor(Homo sapiens (Human))
Merck Research Laboratories
Curated by ChEMBL
LigandPNGBDBM50070179(4-(3-Hexyl-3-methyl-ureido)-N-(4-{2-[(S)-2-hydroxy...)
Affinity DataEC50:  2.10nM. Assay description: Agonist activity towards human Beta-3 adrenergic receptor
In DepthDetails ArticlePubMed