BDBM50070199 1-((6aR,9R,10aR)-7-Methyl-4,6,6a,7,8,9,10,10a-octahydro-indolo[4,3-fg]quinolin-9-ylmethyl)-imidazolidine-2,4-dione::CHEMBL13588
SMILES CN1C[C@H](Cn2cc(O)[nH]c2=O)C[C@H]2[C@H]1Cc1c[nH]c3cccc2c13
InChI Key InChIKey=VCFIBWJEAKOUJM-DJSGYFEHSA-N
Data  6 IC50
  Tab Delimited (TSV)   2D SDfile   Computed 3D by Vconf -m prep SDfile
Find this compound or compounds like it in BindingDB:
Activity Spreadsheet -- Enzyme Inhibition Constant Data from BindingDB
Found 6 hits for monomerid = 50070199
TargetD(2) dopamine receptor(Rattus norvegicus (rat))
Pharmacia & Upjohn
Curated by ChEMBL
LigandPNGBDBM50070199(1-((6aR,9R,10aR)-7-Methyl-4,6,6a,7,8,9,10,10a-octa...)
Affinity DataIC50:  1.12E+3nM. Assay description: Displacement of [3H]-spiroperidol from D2 receptor in rat striatum
In DepthDetails ArticlePubMed
Target5-hydroxytryptamine receptor 1A(Rattus norvegicus (rat))
Pharmacia & Upjohn
Curated by ChEMBL
LigandPNGBDBM50070199(1-((6aR,9R,10aR)-7-Methyl-4,6,6a,7,8,9,10,10a-octa...)
Affinity DataIC50:  730nM. Assay description: Displacement of [3H]-8-OH-DPAT from 5-hydroxytryptamine 1A receptor in rat hippocampus
In DepthDetails ArticlePubMed
TargetSerotonin 2 (5-HT2) receptor(RAT)
Pharmacia & Upjohn
Curated by ChEMBL
LigandPNGBDBM50070199(1-((6aR,9R,10aR)-7-Methyl-4,6,6a,7,8,9,10,10a-octa...)
Affinity DataIC50:  270nM. Assay description: Displacement of [3H]ketanserin from 5-hydroxytryptamine 2 receptor in rat pre frontal cortex
In DepthDetails ArticlePubMed
TargetAlpha-1A/Alpha-1B/Alpha-1D adrenergic receptor(Rattus norvegicus (rat))
Pharmacia & Upjohn
Curated by ChEMBL
LigandPNGBDBM50070199(1-((6aR,9R,10aR)-7-Methyl-4,6,6a,7,8,9,10,10a-octa...)
Affinity DataIC50:  130nM. Assay description: Displacement of [3H]prazosin from Alpha-1 adrenergic receptor in rat frontal cortex
In DepthDetails ArticlePubMed
LigandPNGBDBM50070199(1-((6aR,9R,10aR)-7-Methyl-4,6,6a,7,8,9,10,10a-octa...)
Affinity DataIC50:  170nM. Assay description: Displacement of [3H]yohimbine from Alpha-2 adrenergic receptor in rat frontal cortex
In DepthDetails ArticlePubMed
TargetD(1A) dopamine receptor(RAT)
Pharmacia & Upjohn
Curated by ChEMBL
LigandPNGBDBM50070199(1-((6aR,9R,10aR)-7-Methyl-4,6,6a,7,8,9,10,10a-octa...)
Affinity DataIC50:  2.21E+3nM. Assay description: Displacement of [3H]-SCH-23,390 from D1 receptor in rat striatum
In DepthDetails ArticlePubMed