BDBM50070200 (6aR,9R,10aR)-2-tert-Butyl-7-methyl-4,6,6a,7,8,9,10,10a-octahydro-indolo[4,3-fg]quinoline-9-carboxylic acid (6-chloro-pyridazin-3-yl)-amide::CHEMBL13770
SMILES CN1C[C@@H](C[C@H]2[C@H]1Cc1c[nH]c3cc(cc2c13)C(C)(C)C)C(=O)Nc1ccc(Cl)nn1
InChI Key InChIKey=WZWOJXYVHLNKQO-IDHHARJASA-N
Data  6 IC50
  Tab Delimited (TSV)   2D SDfile   Computed 3D by Vconf -m prep SDfile
Find this compound or compounds like it in BindingDB:
Activity Spreadsheet -- Enzyme Inhibition Constant Data from BindingDB
Found 6 hits for monomerid = 50070200
Target5-hydroxytryptamine receptor 1A(Rattus norvegicus (rat))
Pharmacia & Upjohn
Curated by ChEMBL
LigandPNGBDBM50070200((6aR,9R,10aR)-2-tert-Butyl-7-methyl-4,6,6a,7,8,9,1...)
Affinity DataIC50:  340nM. Assay description: Displacement of [3H]-8-OH-DPAT from 5-hydroxytryptamine 1A receptor in rat hippocampus
In DepthDetails ArticlePubMed
TargetD(2) dopamine receptor(Rattus norvegicus (rat))
Pharmacia & Upjohn
Curated by ChEMBL
LigandPNGBDBM50070200((6aR,9R,10aR)-2-tert-Butyl-7-methyl-4,6,6a,7,8,9,1...)
Affinity DataIC50:  2.62E+3nM. Assay description: Displacement of [3H]-spiroperidol from D2 receptor in rat striatum
In DepthDetails ArticlePubMed
LigandPNGBDBM50070200((6aR,9R,10aR)-2-tert-Butyl-7-methyl-4,6,6a,7,8,9,1...)
Affinity DataIC50:  830nM. Assay description: Displacement of [3H]yohimbine from Alpha-2 adrenergic receptor in rat frontal cortex
In DepthDetails ArticlePubMed
TargetAlpha-1A/Alpha-1B/Alpha-1D adrenergic receptor(Rattus norvegicus (rat))
Pharmacia & Upjohn
Curated by ChEMBL
LigandPNGBDBM50070200((6aR,9R,10aR)-2-tert-Butyl-7-methyl-4,6,6a,7,8,9,1...)
Affinity DataIC50:  6.57E+3nM. Assay description: Displacement of [3H]prazosin from Alpha-1 adrenergic receptor in rat frontal cortex
In DepthDetails ArticlePubMed
TargetSerotonin 2 (5-HT2) receptor(RAT)
Pharmacia & Upjohn
Curated by ChEMBL
LigandPNGBDBM50070200((6aR,9R,10aR)-2-tert-Butyl-7-methyl-4,6,6a,7,8,9,1...)
Affinity DataIC50:  1.22E+3nM. Assay description: Displacement of [3H]ketanserin from 5-hydroxytryptamine 2 receptor in rat pre frontal cortex
In DepthDetails ArticlePubMed
TargetD(1A) dopamine receptor(RAT)
Pharmacia & Upjohn
Curated by ChEMBL
LigandPNGBDBM50070200((6aR,9R,10aR)-2-tert-Butyl-7-methyl-4,6,6a,7,8,9,1...)
Affinity DataIC50:  3.81E+3nM. Assay description: Displacement of [3H]-SCH-23,390 from D1 receptor in rat striatum
In DepthDetails ArticlePubMed