BDBM50070624 CHEMBL417348::N-[3-(4-Amino-butoxy)-5-methyl-phenyl]-benzenesulfonamide
SMILES Cc1cc(NS(=O)(=O)c2ccccc2)cc(OCCCCN)c1
InChI Key InChIKey=JAYCTIMFJZKGNB-UHFFFAOYSA-N
Data  1 KI
  Tab Delimited (TSV)   2D SDfile   Computed 3D by Vconf -m prep SDfile
Find this compound or compounds like it in BindingDB:
Activity Spreadsheet -- Enzyme Inhibition Constant Data from BindingDB
Found 1 hit for monomerid = 50070624
TargetProthrombin(Homo sapiens (Human))
Pharmazeutisch-Chemisches Institut Der UniversitäT
Curated by ChEMBL
LigandPNGBDBM50070624(CHEMBL417348 | N-[3-(4-Amino-butoxy)-5-methyl-phen...)
Affinity DataKi:  6.50E+3nM. Assay description: Inhibitory activity against thrombin
In DepthDetails ArticlePubMed