BDBM50070734 CHEMBL2372705::Nazumamide A (NAZA) analogue
SMILES CC[C@H](C)[C@H](NC(=O)[C@H](CCCCN)NC(=O)c1cc(O)ccc1O)C(=O)N[C@@H](CCC(N)=O)C(=O)N[C@@H](CC)C(O)=O
InChI Key InChIKey=WNTQOLPVRCSYAR-MSMFUVKXSA-N
Data  1 IC50
  Tab Delimited (TSV)   2D SDfile   Computed 3D by Vconf -m prep SDfile
Find this compound or compounds like it in BindingDB:
Activity Spreadsheet -- Enzyme Inhibition Constant Data from BindingDB
Found 1 hit for monomerid = 50070734
TargetProthrombin(Homo sapiens (Human))
Central Drug Research Institute
Curated by ChEMBL
LigandPNGBDBM50070734(CHEMBL2372705 | Nazumamide A (NAZA) analogue)
Affinity DataIC50:  8.20E+4nMpH: 8.3Assay Description:Anti-thrombin activity by competitive enzyme assay using the fluorogenic substrate Tos-Gly-Pro-Arg-AMC at pH 8.3.
In DepthDetails ArticlePubMed